BDBM35676 5H-1-benzazepin-5-ylidene acetamide, 1d
SMILES Cc1ccn(n1)-c1ccc(C(=O)N2CCC(F)(F)\C(=C/C(=O)NCc3ccccc3)c3ccccc23)c(Cl)c1
InChI Key InChIKey=VXSFROCWTXUWPF-BWAHOGKJSA-N
Data  2 KI
  Tab Delimited (TSV)   2D SDfile   Computed 3D by Vconf -m prep SDfile
Find this compound or compounds like it in BindingDB:
Activity Spreadsheet -- Enzyme Inhibition Constant Data from BindingDB
Found 2 hits for monomerid = 35676
TargetVasopressin V2 receptor(Homo sapiens (Human))
Astellas Pharma
LigandPNGBDBM35676(5H-1-benzazepin-5-ylidene acetamide, 1d)
Affinity DataKi:  19nM ΔG°:  -10.5kcal/molepH: 7.4 T: 2°C. Assay description: The affinities of test compounds for human V2 receptor were evaluated by the radioligand binding study using membrane fractions isolated from CHO cel...
In DepthDetails ArticlePubMed
TargetVasopressin V1a receptor(Homo sapiens (Human))
Astellas Pharma
LigandPNGBDBM35676(5H-1-benzazepin-5-ylidene acetamide, 1d)
Affinity DataKi:  43nM ΔG°:  -10.0kcal/moleT: 2°C. Assay description: Chinese hamster ovary (CHO) cells stably expressing human V1a receptors. Cells were washed with phosphate buffered saline, and then collected in ice-...
In DepthDetails ArticlePubMed