BDBM356870 US10214492, Example 220::US11292767, Example 220
SMILES CCn1ncc2ccc(cc12)-c1cc(CO[C@](C)(CC)C(O)=O)nn1Cc1ccccc1Cl
InChI Key InChIKey=HOVFXPXLAFAXCW-RUZDIDTESA-N
Data  4 IC50
  Tab Delimited (TSV)   2D SDfile   Computed 3D by Vconf -m prep SDfile
Find this compound or compounds like it in BindingDB:
Activity Spreadsheet -- Enzyme Inhibition Constant Data from BindingDB
Found 4 hits for monomerid = 356870
TargetMonocarboxylate transporter 4(Homo sapiens (Human))
Vettore
US Patent
LigandPNGBDBM356870(US10214492, Example 220 | US11292767, Example 220)
Affinity DataIC50:  0.540nM. Assay description: MDA-MB-231 breast cancer cells may be used to measure MCT4 activity in cells with high native levels of MCT4 and low levels of MCT1 and are known to ...
Ligand InfoPC cidPC sid
In DepthDetails US Patent
TargetMonocarboxylate transporter 1(Homo sapiens (Human))
Vettore
US Patent
LigandPNGBDBM356870(US10214492, Example 220 | US11292767, Example 220)
Affinity DataIC50:  3.30E+4nM. Assay description: MCT1 activity may be measured using BT-20 breast cancer cells that express high native levels of MCT1, but do not express MCT4 and are known to those...
Ligand InfoPC cidPC sid
In DepthDetails US Patent
TargetMonocarboxylate transporter 4(Homo sapiens (Human))
Vettore
US Patent
LigandPNGBDBM356870(US10214492, Example 220 | US11292767, Example 220)
Affinity DataIC50:  0.540nM. Assay description: MDA-MB-231 breast cancer cells may be used to measure MCT4 activity in cells with high native levels of MCT4 and low levels of MCT1 and are known to ...
Ligand InfoPC cidPC sid
In DepthDetails US Patent
TargetMonocarboxylate transporter 1(Homo sapiens (Human))
Vettore
US Patent
LigandPNGBDBM356870(US10214492, Example 220 | US11292767, Example 220)
Affinity DataIC50:  3.30E+4nM. Assay description: MCT1 activity may be measured using BT-20 breast cancer cells that express high native levels of MCT1, but do not express MCT4 and are known to those...
Ligand InfoPC cidPC sid
In DepthDetails US Patent