BDBM35713 benzazepine derivative, 16
SMILES CN(C)C1CCCN(C(=O)c2ccc(NC(=O)c3ccccc3C)cc2)c2c(Cl)cccc12
InChI Key InChIKey=AGEXZVIELPYYMU-UHFFFAOYSA-N
Data  2 IC50
  Tab Delimited (TSV)   2D SDfile   Computed 3D by Vconf -m prep SDfile
Find this compound or compounds like it in BindingDB:
Activity Spreadsheet -- Enzyme Inhibition Constant Data from BindingDB
Found 2 hits for monomerid = 35713
TargetVasopressin V1a receptor(Homo sapiens (Human))
Otsuka Pharmaceutical
LigandPNGBDBM35713(benzazepine derivative, 16)
Affinity DataIC50:  540nMpH: 7.4 T: 2°C. Assay description: After reaching confluence in 12-well or 24-well dishes, the cells were washed twice with ice-cold PBS and incubated for 2 hr with [3H]-AVP at 4 deg C...
In DepthDetails ArticlePubMed
TargetVasopressin V2 receptor(Homo sapiens (Human))
Otsuka Pharmaceutical
LigandPNGBDBM35713(benzazepine derivative, 16)
Affinity DataIC50:  140nMpH: 7.4 T: 2°C. Assay description: After reaching confluence in 12-well or 24-well dishes, the cells were washed twice with ice-cold PBS and incubated for 2 hr with [3H]-AVP at 4 deg C...
In DepthDetails ArticlePubMed