BDBM357143 (Z)-5-(5-Chloro-2-(difluoromethoxy)phenyl)-2-(24-((methoxycarbonyl)amino)-4-oxo-11H-3-aza-1(4,2)-imidazola-2(1,2) -benzenacyclononaphane-9-yl)pyridine 1-oxide::US10214512, Example 102-a
SMILES COC(=O)Nc1ccc2-c3c[nH]c(n3)C(CCCCC(=O)Nc2c1)c1ccc(c[n+]1[O-])-c1cc(Cl)ccc1OC(F)F
InChI Key
Data  2 KI
  Tab Delimited (TSV)   2D SDfile   Computed 3D by Vconf -m prep SDfile
Find this compound or compounds like it in BindingDB:
Activity Spreadsheet -- Enzyme Inhibition Constant Data from BindingDB
Found 2 hits for monomerid = 357143
TargetCoagulation factor XI(Homo sapiens (Human))
Merck Sharp & Dohme
US Patent
LigandPNGBDBM357143((Z)-5-(5-Chloro-2-(difluoromethoxy)phenyl)-2-(24-(...)
Affinity DataKi:  0.140nM. Assay description: The effectiveness of a compound of the present invention as an inhibitor of Coagulation Factor XIa can be determined using a relevant purified serine...
Ligand InfoPC cidPC sid
In DepthDetails US Patent
TargetKallikrein-1(Homo sapiens (Human))
Merck Sharp & Dohme
US Patent
LigandPNGBDBM357143((Z)-5-(5-Chloro-2-(difluoromethoxy)phenyl)-2-(24-(...)
Affinity DataKi:  0.430nM. Assay description: The effectiveness of a compound of the present invention as an inhibitor of Kallikrein can be determined using a relevant purified serine protease, a...
Ligand InfoPC cidPC sid
In DepthDetails US Patent