BDBM35722 benzazepine derivative, 31
SMILES Cc1ccccc1C(=O)Nc1ccc(cc1Cl)C(=O)N1CCCC(O)c2cc(Cl)ccc12
InChI Key InChIKey=DXBVWMMGZXZIBZ-UHFFFAOYSA-N
Data  2 IC50
  Tab Delimited (TSV)   2D SDfile   Computed 3D by Vconf -m prep SDfile
Find this compound or compounds like it in BindingDB:
Activity Spreadsheet -- Enzyme Inhibition Constant Data from BindingDB
Found 2 hits for monomerid = 35722
TargetVasopressin V1a receptor(Homo sapiens (Human))
Otsuka Pharmaceutical
LigandPNGBDBM35722(benzazepine derivative, 31)
Affinity DataIC50:  31nMpH: 7.4 T: 2°C. Assay description: After reaching confluence in 12-well or 24-well dishes, the cells were washed twice with ice-cold PBS and incubated for 2 hr with [3H]-AVP at 4 deg C...
In DepthDetails ArticlePubMed
TargetVasopressin V2 receptor(Homo sapiens (Human))
Otsuka Pharmaceutical
LigandPNGBDBM35722(benzazepine derivative, 31)
Affinity DataIC50:  28nMpH: 7.4 T: 2°C. Assay description: After reaching confluence in 12-well or 24-well dishes, the cells were washed twice with ice-cold PBS and incubated for 2 hr with [3H]-AVP at 4 deg C...
In DepthDetails ArticlePubMed