BDBM357477 US10214519, Example 221
SMILES Fc1ccc(F)c2c(ccnc12)-n1c(CC2CC2)nc2c(cc(cc12)N1CCOCC1)-c1ncco1
InChI Key InChIKey=VGTRQCPAPIGZSH-UHFFFAOYSA-N
Data  1 IC50
  Tab Delimited (TSV)   2D SDfile   Computed 3D by Vconf -m prep SDfile
Find this compound or compounds like it in BindingDB:
Activity Spreadsheet -- Enzyme Inhibition Constant Data from BindingDB
Found 1 hit for monomerid = 357477
TargetPhosphatidylinositol 3-kinase regulatory subunit beta(Homo sapiens (Human))
Gilead Sciences
US Patent
LigandPNGBDBM357477(US10214519, Example 221)
Affinity DataIC50:  11nM. Assay description: Class I PI3K isoforms were expressed and purified as heterodimeric recombinant proteins. All assay reagents and buffers for the TR-FRET assay were pu...
Ligand InfoPC cidPC sid
In DepthDetails US Patent