BDBM357485 US10214519, Example 229
SMILES Cc1nc2c(cc(cc2n1-c1ccnc2c(F)ccc(F)c12)N1CCOCC1)-c1ncco1
InChI Key InChIKey=CMKVZFOZDSTRQU-UHFFFAOYSA-N
Data  1 IC50
  Tab Delimited (TSV)   2D SDfile   Computed 3D by Vconf -m prep SDfile
Find this compound or compounds like it in BindingDB:
Activity Spreadsheet -- Enzyme Inhibition Constant Data from BindingDB
Found 1 hit for monomerid = 357485
TargetPhosphatidylinositol 3-kinase regulatory subunit beta(Homo sapiens (Human))
Gilead Sciences
US Patent
LigandPNGBDBM357485(US10214519, Example 229)
Affinity DataIC50:  5nM. Assay description: Class I PI3K isoforms were expressed and purified as heterodimeric recombinant proteins. All assay reagents and buffers for the TR-FRET assay were pu...
Ligand InfoPC cidPC sid
In DepthDetails US Patent