BDBM358024 1-(3-(3-(4-amino-5-(1-(tetrahydro-2H-pyran-4- yl)-1H-1,2,3-triazol-5-yl)pyrrolo[2,1-f][1,2,4] triazin-7-yl)phenyl)oxetan-3-yl)piperidin-4-one::US10214537, Example 93
SMILES Nc1ncnn2c(cc(-c3cnnn3C3CCOCC3)c12)-c1cccc(c1)C1(COC1)N1CCC(=O)CC1
InChI Key InChIKey=OQTISDKPXTVESB-UHFFFAOYSA-N
Data  1 IC50
  Tab Delimited (TSV)   2D SDfile   Computed 3D by Vconf -m prep SDfile
Find this compound or compounds like it in BindingDB:
Activity Spreadsheet -- Enzyme Inhibition Constant Data from BindingDB
Found 1 hit for monomerid = 358024
TargetPhosphatidylinositol 4,5-bisphosphate 3-kinase catalytic subunit delta isoform(Homo sapiens (Human))
Bristol-Myers Squibb
US Patent
LigandPNGBDBM358024(1-(3-(3-(4-amino-5-(1-(tetrahydro-2H-pyran-4- yl)-...)
Affinity DataIC50:  1nM. Assay description: The ADP-Glo format PI3K assays were performed in Proxiplate 384-well plates (Perkin Elmer #6008280). The final assay volume was 2 μl prepared fr...
Ligand InfoPC cidPC sid
In DepthDetails US Patent