BDBM358348 4-acetyl-1-(3-(4-amino-5-(2- isobutylthiazol-5-yl)pyrrolo[2,1-f] [1,2,4]triazin-7-yl)phenyl)-3,3- dimethylpiperazin-2-one::US10214537, Example 417
SMILES CC(C)Cc1ncc(s1)-c1cc(-c2cccc(c2)N2CCN(C(C)=O)C(C)(C)C2=O)n2ncnc(N)c12
InChI Key InChIKey=HBIMPYOYIKSNOV-UHFFFAOYSA-N
Data  1 IC50
  Tab Delimited (TSV)   2D SDfile   Computed 3D by Vconf -m prep SDfile
Find this compound or compounds like it in BindingDB:
Activity Spreadsheet -- Enzyme Inhibition Constant Data from BindingDB
Found 1 hit for monomerid = 358348
TargetPhosphatidylinositol 4,5-bisphosphate 3-kinase catalytic subunit delta isoform(Homo sapiens (Human))
Bristol-Myers Squibb
US Patent
LigandPNGBDBM358348(4-acetyl-1-(3-(4-amino-5-(2- isobutylthiazol-5-yl)...)
Affinity DataIC50:  4nM. Assay description: The ADP-Glo format PI3K assays were performed in Proxiplate 384-well plates (Perkin Elmer #6008280). The final assay volume was 2 μl prepared fr...
Ligand InfoPC cidPC sid
In DepthDetails US Patent