BDBM358386 4-acetyl-1-(3-{4-amino-5-[1-(2,2- difluoroethyl)-1H-pyrazol-5-yl] pyrrolo[2,1-f][1,2,4]triazin-7-yl} phenyl)-3,3-dimethylpiperazin-2-one::US10214537, Example 456
SMILES CC(=O)N1CCN(C(=O)C1(C)C)c1cccc(c1)-c1cc(-c2ccnn2CC(F)F)c2c(N)ncnn12
InChI Key InChIKey=UTWAGEVGDDQOQC-UHFFFAOYSA-N
Data  1 IC50
  Tab Delimited (TSV)   2D SDfile   Computed 3D by Vconf -m prep SDfile
Find this compound or compounds like it in BindingDB:
Activity Spreadsheet -- Enzyme Inhibition Constant Data from BindingDB
Found 1 hit for monomerid = 358386
TargetPhosphatidylinositol 4,5-bisphosphate 3-kinase catalytic subunit delta isoform(Homo sapiens (Human))
Bristol-Myers Squibb
US Patent
LigandPNGBDBM358386(4-acetyl-1-(3-{4-amino-5-[1-(2,2- difluoroethyl)-1...)
Affinity DataIC50:  4nM. Assay description: The ADP-Glo format PI3K assays were performed in Proxiplate 384-well plates (Perkin Elmer #6008280). The final assay volume was 2 μl prepared fr...
Ligand InfoPC cidPC sid
In DepthDetails US Patent