BDBM358732 7-(3-(4-acetyl-3,3-dimethyl-2- oxopiperazin-1-yl)-4-(1-methyl-1H- 1,2,4-triazol-3-yl)phenyl)-4- aminopyrrolo[2,1-f][1,2,4]triazine-5- carbonitrile::US10214537, Example 811
SMILES CC(=O)N1CCN(C(=O)C1(C)C)c1cc(ccc1-c1ncn(C)n1)-c1cc(C#N)c2c(N)ncnn12
InChI Key InChIKey=RWNPQPVJYUYBTM-UHFFFAOYSA-N
Data  1 IC50
  Tab Delimited (TSV)   2D SDfile   Computed 3D by Vconf -m prep SDfile
Find this compound or compounds like it in BindingDB:
Activity Spreadsheet -- Enzyme Inhibition Constant Data from BindingDB
Found 1 hit for monomerid = 358732
TargetPhosphatidylinositol 4,5-bisphosphate 3-kinase catalytic subunit delta isoform(Homo sapiens (Human))
Bristol-Myers Squibb
US Patent
LigandPNGBDBM358732(7-(3-(4-acetyl-3,3-dimethyl-2- oxopiperazin-1-yl)-...)
Affinity DataIC50:  2nM. Assay description: The ADP-Glo format PI3K assays were performed in Proxiplate 384-well plates (Perkin Elmer #6008280). The final assay volume was 2 μl prepared fr...
Ligand InfoPC cidPC sid
In DepthDetails US Patent