BDBM35904 flufenamic acid analogue, 31
SMILES OC(=O)c1ccccc1Nc1cc(Oc2ccccc2)cc(Oc2ccccc2)c1
InChI Key InChIKey=YIILDWDUPVMMOO-UHFFFAOYSA-N
Data  1 IC50  1 EC50
  Tab Delimited (TSV)   2D SDfile   Computed 3D by Vconf -m prep SDfile
Find this compound or compounds like it in BindingDB:
Activity Spreadsheet -- Enzyme Inhibition Constant Data from BindingDB
Found 1 hit for monomerid = 35904
TargetAndrogen receptor(Homo sapiens (Human))
St. Jude Research Hospital
LigandPNGBDBM35904(flufenamic acid analogue, 31)
Affinity DataIC50:  5.76E+4nM EC50:  1.90E+4nMpH: 7.2 T: 2°C. Assay description: A radiolabeled ligand competition scintillation proximity assay (SPA) for the androgen receptor (AR) using Ni-coated 384-well FlashPlates. It measure...
In DepthDetails ArticlePubMed