BDBM359273 US10221129, Example CA-7
SMILES COc1ccc(cc1)N(C)C(=O)[C@H](Cc1ccccc1)NC(=O)NS(=O)(=O)Nc1ccccc1F
InChI Key InChIKey=LXLVFGBDYHSECP-QFIPXVFZSA-N
Data  1 EC50
  Tab Delimited (TSV)   2D SDfile   Computed 3D by Vconf -m prep SDfile
Find this compound or compounds like it in BindingDB:
Activity Spreadsheet -- Enzyme Inhibition Constant Data from BindingDB
Found 1 hit for monomerid = 359273
TargetEnvelope glycoprotein gp160(Human immunodeficiency virus type 1 (isolate BRU/L...)
Viiv Healthcare UK (NO.5)
US Patent
LigandPNGBDBM359273(US10221129, Example CA-7)
Affinity DataEC50:  140nM. Assay description: HIV cell culture assay-MT-2 cells, 293T cells and the proviral DNA clone of NL4-3 virus were obtained from the NIH AIDS Research and Reference Reagen...
Ligand InfoPC cidPC sid
In DepthDetails US Patent