BDBM35944 4-pyridinoxy-2-anilinopyridine-based compound, 8
SMILES COc1cc(Nc2cc(Oc3ccc(C)nc3)ccn2)cc(OC)c1OC
InChI Key InChIKey=FUUAJSSRXYXCAH-UHFFFAOYSA-N
Data  1 IC50  1 EC50
  Tab Delimited (TSV)   2D SDfile   Computed 3D by Vconf -m prep SDfile
Find this compound or compounds like it in BindingDB:
Activity Spreadsheet -- Enzyme Inhibition Constant Data from BindingDB
Found 1 hit for monomerid = 35944
TargetTGF-beta receptor type-1(Homo sapiens (Human))
Astrazeneca
LigandPNGBDBM35944(4-pyridinoxy-2-anilinopyridine-based compound, 8)
Affinity DataIC50:  108nM EC50:  282nMpH: 7.4 T: 2°C. Assay description: A fluorescence polarization assay was used to assess the ALK5 binding capacity and biochemical activity of compounds. ALK5 protein was added to each ...
In DepthDetails ArticlePubMed