BDBM359454 US10221129, Example CA-141
SMILES CCCN(C)S(=O)(=O)NC(=O)N[C@@H](Cc1cc(F)cc(F)c1)C(=O)N(C)c1ccc2scnc2c1
InChI Key InChIKey=PUQUIZRNVGIPOA-IBGZPJMESA-N
Data  1 EC50
  Tab Delimited (TSV)   2D SDfile   Computed 3D by Vconf -m prep SDfile
Find this compound or compounds like it in BindingDB:
Activity Spreadsheet -- Enzyme Inhibition Constant Data from BindingDB
Found 1 hit for monomerid = 359454
TargetEnvelope glycoprotein gp160(Human immunodeficiency virus type 1 (isolate BRU/L...)
Viiv Healthcare UK (NO.5)
US Patent
LigandPNGBDBM359454(US10221129, Example CA-141)
Affinity DataEC50:  40nM. Assay description: HIV cell culture assay-MT-2 cells, 293T cells and the proviral DNA clone of NL4-3 virus were obtained from the NIH AIDS Research and Reference Reagen...
Ligand InfoPC cidPC sid
In DepthDetails US Patent