BDBM35962 acyclic compound, 13g
SMILES [H][C@@]1(CO[C@@]2([H])OCC[C@@]12[H])OC(=O)N[C@@H](Cc1ccccc1)[C@H](O)CN(CC=C)S(=O)(=O)c1ccc(OC)cc1OCCC=C
InChI Key InChIKey=ZOQNQJASZAYUOG-ZLBJCVPKSA-N
Data  1 KI
  Tab Delimited (TSV)   2D SDfile   Computed 3D by Vconf -m prep SDfile
Find this compound or compounds like it in BindingDB:
Activity Spreadsheet -- Enzyme Inhibition Constant Data from BindingDB
Found 1 hit for monomerid = 35962
TargetDimer of Gag-Pol polyprotein [501-599,Q508K,L534I,L564I,C568A,C596A](Human immunodeficiency virus type 1)
Purdue University
LigandPNGBDBM35962(acyclic compound, 13g)
Affinity DataKi:  0.630nM ΔG°:  -12.5kcal/molepH: 6.4 T: 2°C. Assay description: The Ki values were determined by substrate cleavage assay using fluorogenic substrate, 2-(aminobenzoyl)-Thr-Ile-Nle-Phe(p-NO2)-Gln-Arg-NH2. A standar...
In DepthDetails ArticlePubMed