BDBM35981 cyclic compound, 14b-Z
SMILES [H][C@@]1(CO[C@@]2([H])OCC[C@@]12[H])OC(=O)N[C@@H](Cc1ccccc1)[C@H](O)CN1CCCC\C=C/CCCOc2cc(OC)ccc2S1(=O)=O
InChI Key InChIKey=PAUIHFDXSPYWNF-SSJVAFASSA-N
Data  1 KI  1 EC50
  Tab Delimited (TSV)   2D SDfile   Computed 3D by Vconf -m prep SDfile
Find this compound or compounds like it in BindingDB:
Activity Spreadsheet -- Enzyme Inhibition Constant Data from BindingDB
Found 1 hit for monomerid = 35981
TargetDimer of Gag-Pol polyprotein [501-599,Q508K,L534I,L564I,C568A,C596A](Human immunodeficiency virus type 1)
Purdue University
LigandPNGBDBM35981(cyclic compound, 14b-Z)
Affinity DataKi:  0.900nM ΔG°:  -12.3kcal/mole EC50:  2.90nMpH: 6.4 T: 2°C. Assay description: The Ki values were determined by substrate cleavage assay using fluorogenic substrate, 2-(aminobenzoyl)-Thr-Ile-Nle-Phe(p-NO2)-Gln-Arg-NH2. A standar...
In DepthDetails ArticlePubMed