BDBM360498 N-((5-(3-methoxyphenyl)isoquinolin- 8-yl)methyl)-2-(2- phenoxyphenyl)acetamide::US9828369, Example 55
SMILES COc1cccc(c1)-c1ccc(CNC(=O)Cc2ccccc2Oc2ccccc2)c2cnccc12
InChI Key InChIKey=QORTYUUGHUCEOY-UHFFFAOYSA-N
Data  1 IC50
  Tab Delimited (TSV)   2D SDfile   Computed 3D by Vconf -m prep SDfile
Find this compound or compounds like it in BindingDB:
Activity Spreadsheet -- Enzyme Inhibition Constant Data from BindingDB
Found 1 hit for monomerid = 360498
TargetDiacylglycerol O-acyltransferase 2(Homo sapiens (Human))
Merck Sharpe & Dohme
US Patent
LigandPNGBDBM360498(N-((5-(3-methoxyphenyl)isoquinolin- 8-yl)methyl)-2...)
Affinity DataIC50:  306nM. Assay description: DGAT2 activity was determined by measuring the amount of enzymatic product triolein (1,2,3-Tri(cis-9-octadecenoyl)glycerol) using the membrane prep m...
Ligand InfoPC cidPC sid
In DepthDetails US Patent