BDBM3612 4-N-(3-bromophenyl)-7-N-methylpyrido[2,3-d]pyrimidine-4,7-diamine::4-[(3-bromophenyl)amino]-7-(methylamino)pyrido[2,3-d]pyrimidine::CHEMBL298637::Pyrido[2,3-d]pyrimidine 9f
SMILES CNc1ccc2c(Nc3cccc(Br)c3)ncnc2n1
InChI Key InChIKey=WMBRHVWLKLLTEE-UHFFFAOYSA-N
Data  2 IC50
  Tab Delimited (TSV)   2D SDfile   Computed 3D by Vconf -m prep SDfile
Find this compound or compounds like it in BindingDB:
Activity Spreadsheet -- Enzyme Inhibition Constant Data from BindingDB
Found 2 hits for monomerid = 3612
TargetEpidermal growth factor receptor(Homo sapiens (Human))
University Of Zurich
Curated by ChEMBL
LigandPNGBDBM3612(4-N-(3-bromophenyl)-7-N-methylpyrido[2,3-d]pyrimid...)
Affinity DataIC50:  52nM. Assay description: Inhibition of EGFR
In DepthDetails ArticlePubMed
TargetEpidermal growth factor receptor(Homo sapiens (Human))
University Of Zurich
Curated by ChEMBL
LigandPNGBDBM3612(4-N-(3-bromophenyl)-7-N-methylpyrido[2,3-d]pyrimid...)
Affinity DataIC50:  52nM. Assay description: IC50 is the inhibitor concentration which inhibits 50% of kinase activity that catalyzes the transfer of the terminal phosphate from [gamma-32P] labe...
In DepthDetails ArticlePubMed