BDBM361734 US10221177, Compound 97
SMILES C[C@@H](C(=O)Nc1cccc(n1)-c1cnc(C)c(c1)C(F)(F)F)n1cnc2n(C)c(=O)n(CC(C)=O)c(=O)c12
InChI Key InChIKey=CZWUSKMGGLHRBH-AWEZNQCLSA-N
Data  1 IC50
  Tab Delimited (TSV)   2D SDfile   Computed 3D by Vconf -m prep SDfile
Find this compound or compounds like it in BindingDB:
Activity Spreadsheet -- Enzyme Inhibition Constant Data from BindingDB
Found 1 hit for monomerid = 361734
TargetTransient receptor potential cation channel subfamily A member 1(Homo sapiens (Human))
Hydra Biosciences
US Patent
LigandPNGBDBM361734(US10221177, Compound 97)
Affinity DataIC50:  5nM. Assay description: Compounds of Formula (I) inhibit the TRPA1 channel, as shown by measuring the in vitro inhibition of human TRPA1, provided in data tables shown in Ta...
Ligand InfoPC cidPC sid
In DepthDetails US Patent