BDBM36335 US10639284, Compound 1.001::US11426364, Compound 1.001
SMILES OC[C@H](NCc1cc(Cl)c(OC2CCc3c2cccc3-c2ccccc2)cc1OCc1cncc(c1)C#N)C(O)=O
InChI Key InChIKey=XINKNBMIVAEBNP-UKDJSQQHSA-N
Data  4 IC50
  Tab Delimited (TSV)   2D SDfile   Computed 3D by Vconf -m prep SDfile
Find this compound or compounds like it in BindingDB:
Activity Spreadsheet -- Enzyme Inhibition Constant Data from BindingDB
Found 4 hits for monomerid = 36335
TargetProgrammed cell death 1 ligand 1(Homo sapiens (Human))
Chemocentryx
US Patent
LigandPNGBDBM36335(US10639284, Compound 1.001 | US11426364, Compound ...)
Affinity DataIC50: <100nM. Assay description: Plates were coated with 1 μg/mL of human PD-L1 (obtained from R&D) in PBS overnight at 4° C. The wells were then blocked with PBS containing 2% BSA...
Ligand InfoKEGGPC cidPC sid
In DepthDetails US Patent
TargetProgrammed cell death 1 ligand/protein 1(Homo sapiens)
Chinese Academy Of Medical Sciences & Peking Union Medical College
Curated by ChEMBL
LigandPNGBDBM36335(US10639284, Compound 1.001 | US11426364, Compound ...)
Affinity DataIC50: <100nM. Assay description: Inhibition of PD-1/PDL1 protein-protein interaction (unknown origin)
Ligand InfoKEGGPC cidPC sid
In DepthDetails ArticlePubMed
TargetProgrammed cell death 1 ligand 1(Homo sapiens (Human))
Chemocentryx
US Patent
LigandPNGBDBM36335(US10639284, Compound 1.001 | US11426364, Compound ...)
Affinity DataIC50: <100nM. Assay description: Plates were coated with 1 μg/mL of human PD-L1 (obtained from R&D) in PBS overnight at 4° C. The wells were then blocked with PBS containing 2% ...
Ligand InfoKEGGPC cidPC sid
In DepthDetails US Patent
TargetProgrammed cell death 1 ligand 1(Homo sapiens (Human))
Chemocentryx
US Patent
LigandPNGBDBM36335(US10639284, Compound 1.001 | US11426364, Compound ...)
Affinity DataIC50: <100nM. Assay description: Inhibition of PDL1 (unknown origin)
Ligand InfoKEGGPC cidPC sid
In DepthDetails ArticlePubMed