BDBM36358 (3R,6R,7S,8E,10S,11S,12E,14E,16R,18R,19R,20R,21S)-7-acetoxy-3,6,16,21-tetrahydroxy-6,10,12,16,20-pentamethyl-18,19-epoxytricosa-8,12,14-triene-11-olide::CID16202131::Pla-D, 6
SMILES CC[C@H](O)[C@@H](C)[C@H]1O[C@@H]1C[C@@](C)(O)\C=C\C=C(/C)[C@H]1OC(=O)C[C@H](O)CC[C@@](C)(O)[C@@H](OC(C)=O)\C=C\[C@@H]1C
InChI Key InChIKey=SDUSVHUQNWGNCQ-MLQHUJDKSA-N
Data  2 EC50
PDB links: 1 PDB ID matches this monomer.
  Tab Delimited (TSV)   2D SDfile   Computed 3D by Vconf -m prep SDfile
Find this compound or compounds like it in BindingDB:
Activity Spreadsheet -- Enzyme Inhibition Constant Data from BindingDB
Found 2 hits for monomerid = 36358
TargetSplicing factor 3B subunit 3(Homo sapiens (Human))
Eisai
LigandPNGBDBM36358((3R,6R,7S,8E,10S,11S,12E,14E,16R,18R,19R,20R,21S)-...)
Affinity DataEC50:  6nMpH: 7.8 T: 2°C. Assay description: Cell proliferation assay using WiDr
TargetSplicing factor 3B subunit 3(Homo sapiens (Human))
Eisai
LigandPNGBDBM36358((3R,6R,7S,8E,10S,11S,12E,14E,16R,18R,19R,20R,21S)-...)
Affinity DataEC50:  4.30nMpH: 7.8 T: 2°C. Assay description: Placental alkaline phosphatase (PLAP) reporter assay controlled by VEGF promoter (VEGF-PLAP)