BDBM363756 US9855229, Compound 10
SMILES CCS(=O)(=O)c1ccc(CC(=O)Nc2ccc(OC3(CCOCC3)c3ccc(Cl)cc3Cl)c(F)c2)cc1
InChI Key InChIKey=GXWMFUWQSHQYNM-UHFFFAOYSA-N
Data  1 IC50
  Tab Delimited (TSV)   2D SDfile   Computed 3D by Vconf -m prep SDfile
Find this compound or compounds like it in BindingDB:
Activity Spreadsheet -- Enzyme Inhibition Constant Data from BindingDB
Found 1 hit for monomerid = 363756
TargetNuclear receptor ROR-gamma(Homo sapiens (Human))
Glenmark Pharmaceuticals
US Patent
LigandPNGBDBM363756(US9855229, Compound 10)
Affinity DataIC50:  16.2nM. Assay description: The assay is based on the principle that binding of the agonist to the RORγ causes a conformational change around helix 12 in the ligand binding...
Ligand InfoPC cidPC sid
In DepthDetails US Patent