BDBM363767 2-Ethyl-6,7-dimethoxy-1-oxo-1,2-dihydro-isoquinoline-4-carboxylic acid (1-phenyl-ethyl)-amide::US9856220, Example 29
SMILES CCn1cc(C(=O)NC(C)c2ccccc2)c2cc(OC)c(OC)cc2c1=O
InChI Key InChIKey=KLWYTSBIUIQZOZ-UHFFFAOYSA-N
Data  1 IC50
  Tab Delimited (TSV)   2D SDfile   Computed 3D by Vconf -m prep SDfile
Find this compound or compounds like it in BindingDB:
Activity Spreadsheet -- Enzyme Inhibition Constant Data from BindingDB
Found 1 hit for monomerid = 363767
TargetcAMP and cAMP-inhibited cGMP 3',5'-cyclic phosphodiesterase 10A(Homo sapiens (Human))
Abbvie Deutschland
US Patent
LigandPNGBDBM363767(2-Ethyl-6,7-dimethoxy-1-oxo-1,2-dihydro-isoquinoli...)
Affinity DataIC50:  350nM. Assay description: The PDE enzymatic reaction was carried out in assay buffer (20 mM Tris-HCl pH7.5, 10 mM MgCl2, 0.1% bovine serum albumin) containing enzyme and subst...
Ligand InfoPC cidPC sid
In DepthDetails US Patent