BDBM36427 3,5-Dichloro-N-(2-(4-(2-oxo-2,3-dihydro-1H-benzo[d]imidazol-1-yl)piperidin-1-yl)ethyl)benzamide, 49::CID25105700
SMILES Clc1cc(Cl)cc(c1)C(=O)NCCN1CCC(CC1)n1c2ccccc2[nH]c1=O
InChI Key InChIKey=ITAGWXHMZOIMAL-UHFFFAOYSA-N
Data  3 IC50  2 EC50
  Tab Delimited (TSV)   2D SDfile   Computed 3D by Vconf -m prep SDfile
Find this compound or compounds like it in BindingDB:
Activity Spreadsheet -- Enzyme Inhibition Constant Data from BindingDB
Found 5 hits for monomerid = 36427
TargetPhospholipase D1(Homo sapiens (Human))
Vanderbilt University
LigandPNGBDBM36427(3,5-Dichloro-N-(2-(4-(2-oxo-2,3-dihydro-1H-benzo[d...)
Affinity DataIC50:  400nMT: 2°C. Assay description: PLD in vitro enzymatic assay using phospholipase D1(PLD1).
In DepthDetails ArticlePubMed
TargetPhospholipase D1(Homo sapiens (Human))
Vanderbilt University
LigandPNGBDBM36427(3,5-Dichloro-N-(2-(4-(2-oxo-2,3-dihydro-1H-benzo[d...)
Affinity DataIC50:  1.90E+3nMT: 2°C. Assay description: PLD in vitro enzymatic assay using phospholipase D2(PLD2).
In DepthDetails ArticlePubMed
TargetPhospholipase D1(Homo sapiens (Human))
Vanderbilt University
LigandPNGBDBM36427(3,5-Dichloro-N-(2-(4-(2-oxo-2,3-dihydro-1H-benzo[d...)
Affinity DataEC50:  1.10E+3nMT: 2°C. Assay description: cell-based assay using HEK293-gfpPLD2 cell line
In DepthDetails ArticlePubMed
TargetPhospholipase D1(Homo sapiens (Human))
Vanderbilt University
LigandPNGBDBM36427(3,5-Dichloro-N-(2-(4-(2-oxo-2,3-dihydro-1H-benzo[d...)
Affinity DataEC50:  85nMT: 2°C. Assay description: cell-based assay using human non-small-cell lung cancer cell line, Calu-1
In DepthDetails ArticlePubMed
TargetPhospholipase D1(Homo sapiens (Human))
Vanderbilt University
LigandPNGBDBM36427(3,5-Dichloro-N-(2-(4-(2-oxo-2,3-dihydro-1H-benzo[d...)
Affinity DataIC50:  3.50E+3nMT: 2°C. Assay description: Phopholipase D1(PLD)enzymatic inhibition assay using PLD1.d311
In DepthDetails ArticlePubMed