BDBM364507 3-({[3-(1-methyl-1H-pyrazol-3-yl)- 4- (trifluoromethyl)phenyl]carbonyl} amino)-2-phenyl-2H-indazole-6- carboxamide::US9862707, Example 82
SMILES Cn1ccc(n1)-c1cc(ccc1C(F)(F)F)C(=O)Nc1n(nc2cc(ccc12)C(N)=O)-c1ccccc1
InChI Key InChIKey=ZCNGBXMCQVZBFM-UHFFFAOYSA-N
Data  1 IC50
  Tab Delimited (TSV)   2D SDfile   Computed 3D by Vconf -m prep SDfile
Find this compound or compounds like it in BindingDB:
Activity Spreadsheet -- Enzyme Inhibition Constant Data from BindingDB
Found 1 hit for monomerid = 364507
TargetHigh affinity nerve growth factor receptor(Homo sapiens (Human))
Merck Sharp & Dohme
US Patent
LigandPNGBDBM364507(3-({[3-(1-methyl-1H-pyrazol-3-yl)- 4- (trifluorome...)
Affinity DataIC50:  2.70nM. Assay description: TrkA functional activity was measured using a DiscoverX PathHunter assay. In this assay, U2OS cells express the human TrkA receptor as a fusion with ...
Ligand InfoPC cidPC sid
In DepthDetails US Patent