BDBM364697 US9862730, Example 156
SMILES CSc1nn2cc(nc2s1)-c1nc2c(OCc3cccc(c3)C#N)cccc2o1
InChI Key InChIKey=SDALNOPYOXNUAD-UHFFFAOYSA-N
Data  1 IC50
  Tab Delimited (TSV)   2D SDfile   Computed 3D by Vconf -m prep SDfile
Find this compound or compounds like it in BindingDB:
Activity Spreadsheet -- Enzyme Inhibition Constant Data from BindingDB
Found 1 hit for monomerid = 364697
TargetProteinase-activated receptor 4(Homo sapiens (Human))
Bristol-Myers Squibb
US Patent
LigandPNGBDBM364697(US9862730, Example 156)
Affinity DataIC50:  1.02E+3nM. Assay description: The FLIPR assay is an exemplary in vitro assay for measuring the activity of the PAR4 antagonists of the present invention. In this assay, intracellu...
Ligand InfoPC cidPC sid
In DepthDetails US Patent