BDBM364777 US9862730, Example 234
SMILES Cc1cccc2cc(oc12)-c1cn2nc(sc2n1)C(C)(F)F
InChI Key InChIKey=IJFZXTARLNHHHG-UHFFFAOYSA-N
Data  1 IC50
  Tab Delimited (TSV)   2D SDfile   Computed 3D by Vconf -m prep SDfile
Find this compound or compounds like it in BindingDB:
Activity Spreadsheet -- Enzyme Inhibition Constant Data from BindingDB
Found 1 hit for monomerid = 364777
TargetProteinase-activated receptor 4(Homo sapiens (Human))
Bristol-Myers Squibb
US Patent
LigandPNGBDBM364777(US9862730, Example 234)
Affinity DataIC50:  113nM. Assay description: The FLIPR assay is an exemplary in vitro assay for measuring the activity of the PAR4 antagonists of the present invention. In this assay, intracellu...
Ligand InfoPC cidPC sid
In DepthDetails US Patent