BDBM36567 EHO
SMILES OC(CN(CCc1ccc2OCOc2c1)C(=O)CCN1C(=O)c2ccccc2C1=O)[C@@H](NC(=O)COc1ccc(Cl)c(Cl)c1)c1ccccc1
InChI Key InChIKey=GYAXCCWVFILBHR-YBQHVXFOSA-N
Data  1 KI  1 IC50
  Tab Delimited (TSV)   2D SDfile   Computed 3D by Vconf -m prep SDfile
Find this compound or compounds like it in BindingDB:
Activity Spreadsheet -- Enzyme Inhibition Constant Data from BindingDB
Found 1 hit for monomerid = 36567
TargetCathepsin D(Homo sapiens (Human))
University Of California Berkeley
LigandPNGBDBM36567(EHO)
Affinity DataKi:  15nM IC50:  19nMpH: 3.7Assay Description:A fluorometric high through-put assay for inhibitor towards human liver cathepsin D from Calbiochem.
In DepthDetails ArticlePubMed