BDBM36577 Bicyclic core, rac-13b
SMILES CC[C@@H]1C2C([C@@H](N(C)C2(C)C)c2ccc(cc2)C(N)=N)C(=O)N1Cc1ccc2OCOc2c1
InChI Key InChIKey=HQVPEQYGMUJQHM-AULURCSPSA-N
Data  2 KI
  Tab Delimited (TSV)   2D SDfile   Computed 3D by Vconf -m prep SDfile
Find this compound or compounds like it in BindingDB:
Activity Spreadsheet -- Enzyme Inhibition Constant Data from BindingDB
Found 2 hits for monomerid = 36577
TargetProthrombin(Homo sapiens (Human))
Laboratorium FÜR Organische Chemie
LigandPNGBDBM36577(Bicyclic core, rac-13b)
Affinity DataKi:  95nM. Assay description: Enzyme inhibition assay using thrombin, a trypsin-like serine protease.
In DepthDetails ArticlePubMed
TargetSerine protease 1(Homo sapiens (Human))
Laboratorium FÜR Organische Chemie
LigandPNGBDBM36577(Bicyclic core, rac-13b)
Affinity DataKi:  7.30E+3nM. Assay description: Enzyme inhibition assay using thrombin, a trypsin-like serine protease.
In DepthDetails ArticlePubMed