BDBM365888 2-[4-({[2- (dimethylamino)ethyl]amino} methyl)-3,5- dimethoxyphenoxymethyl]-6- phenylbenzonitrile::US9872852, Example 140
SMILES COc1cc(OCc2cccc(-c3ccccc3)c2C#N)cc(OC)c1CNCCN(C)C
InChI Key InChIKey=FOQIRHYDHROHMG-UHFFFAOYSA-N
Data  1 IC50
  Tab Delimited (TSV)   2D SDfile   Computed 3D by Vconf -m prep SDfile
Find this compound or compounds like it in BindingDB:
Activity Spreadsheet -- Enzyme Inhibition Constant Data from BindingDB
Found 1 hit for monomerid = 365888
TargetProgrammed cell death 1 ligand 1(Homo sapiens (Human))
Bristol-Myers Squibb
US Patent
LigandPNGBDBM365888(2-[4-({[2- (dimethylamino)ethyl]amino} methyl)-3,5...)
Affinity DataIC50:  53nM. Assay description: All binding studies were performed in an HTRF assay buffer consisting of dPBS supplemented with 0.1% (withv) bovine serum albumin and 0.05% (v/v) Twe...
Ligand InfoPC cidPC sid
In DepthDetails US Patent