BDBM36591 FOS-37
SMILES [#6]-[#8]-[#6@@H]-1-[#6@H](-[#8])-[#6]-[#6][C@]2([#6]-[#8]2)[#6]-1[C@]1([#6])[#8]-[#6]1-[#6]\[#6]=[#6](\[#6])-[#6]
InChI Key InChIKey=CEVCTNCUIVEQOY-JTUARXPBSA-N
Data  1 IC50  1 EC50
  Tab Delimited (TSV)   2D SDfile   Computed 3D by Vconf -m prep SDfile
Find this compound or compounds like it in BindingDB:
Activity Spreadsheet -- Enzyme Inhibition Constant Data from BindingDB
Found 2 hits for monomerid = 36591
TargetMethionine aminopeptidase 2(Mus musculus (Mouse))
Massachusetts Institute Of Technology
LigandPNGBDBM36591(FOS-37)
Affinity DataEC50:  9.5nMpH: 7.5Assay Description:Proliferation assay using bovine aortic endothelial cell (BAEC) line.
In DepthDetails ArticlePubMed
TargetMethionine aminopeptidase 2(Homo sapiens (Human))
Massachusetts Institute Of Technology
LigandPNGBDBM36591(FOS-37)
Affinity DataIC50:  8nMpH: 7.35 T: 2°C. Assay description: Enzymatic assay using recombinant human type 2 methionine aminopeptidase (MetAP2).
In DepthDetails ArticlePubMed