BDBM365924 2-({3-[({2,6-dimethoxy-4-[(2- methyl-3- phenylphenyl)methoxy]phenyl} methyl)amino]propyl}(2- hydroxyethyl)amino)ethan-1-ol::US9872852, Example 176
SMILES COc1cc(OCc2cccc(c2C)-c2ccccc2)cc(OC)c1CNCCCN(CCO)CCO
InChI Key InChIKey=UMYIMKKJDIVLKQ-UHFFFAOYSA-N
Data  1 IC50
  Tab Delimited (TSV)   2D SDfile   Computed 3D by Vconf -m prep SDfile
Find this compound or compounds like it in BindingDB:
Activity Spreadsheet -- Enzyme Inhibition Constant Data from BindingDB
Found 1 hit for monomerid = 365924
TargetProgrammed cell death 1 ligand 1(Homo sapiens (Human))
Bristol-Myers Squibb
US Patent
LigandPNGBDBM365924(2-({3-[({2,6-dimethoxy-4-[(2- methyl-3- phenylphen...)
Affinity DataIC50:  555nM. Assay description: All binding studies were performed in an HTRF assay buffer consisting of dPBS supplemented with 0.1% (withv) bovine serum albumin and 0.05% (v/v) Twe...
Ligand InfoPC cidPC sid
In DepthDetails US Patent