BDBM365956 2-[(2-methyl-3- phenylphenyl)methoxy]-5- (pyrrolidin-1-ylmethyl)pyridine::US9872852, Example 208
SMILES Cc1c(COc2ccc(CN3CCCC3)cn2)cccc1-c1ccccc1
InChI Key InChIKey=ZXAATNQIZOFNLF-UHFFFAOYSA-N
Data  1 IC50
  Tab Delimited (TSV)   2D SDfile   Computed 3D by Vconf -m prep SDfile
Find this compound or compounds like it in BindingDB:
Activity Spreadsheet -- Enzyme Inhibition Constant Data from BindingDB
Found 1 hit for monomerid = 365956
TargetProgrammed cell death 1 ligand 1(Homo sapiens (Human))
Bristol-Myers Squibb
US Patent
LigandPNGBDBM365956(2-[(2-methyl-3- phenylphenyl)methoxy]-5- (pyrrolid...)
Affinity DataIC50:  555nM. Assay description: All binding studies were performed in an HTRF assay buffer consisting of dPBS supplemented with 0.1% (withv) bovine serum albumin and 0.05% (v/v) Twe...
Ligand InfoPC cidPC sid
In DepthDetails US Patent