BDBM366025 (1R,2R)-2-[({2,6-dimethoxy-4-[(2- methyl-3- phenylphenyl)methoxy]phenyl} methyl)amino]cyclopentan-1-ol::US9872852, Example 277
SMILES COc1cc(OCc2cccc(c2C)-c2ccccc2)cc(OC)c1CN[C@@H]1CCC[C@H]1O
InChI Key InChIKey=VQHLTBODBCNTSO-CLJLJLNGSA-N
Data  1 IC50
  Tab Delimited (TSV)   2D SDfile   Computed 3D by Vconf -m prep SDfile
Find this compound or compounds like it in BindingDB:
Activity Spreadsheet -- Enzyme Inhibition Constant Data from BindingDB
Found 1 hit for monomerid = 366025
TargetProgrammed cell death 1 ligand 1(Homo sapiens (Human))
Bristol-Myers Squibb
US Patent
LigandPNGBDBM366025((1R,2R)-2-[({2,6-dimethoxy-4-[(2- methyl-3- phenyl...)
Affinity DataIC50:  53nM. Assay description: All binding studies were performed in an HTRF assay buffer consisting of dPBS supplemented with 0.1% (withv) bovine serum albumin and 0.05% (v/v) Twe...
Ligand InfoPC cidPC sid
In DepthDetails US Patent