BDBM366060 US9873683, Example 65
SMILES Oc1cc(ccc1-c1nccn1CCc1ccccc1)N1c2ccc3ccccc3c2NC(=O)CC1=O
InChI Key InChIKey=IATIIOPGQZRQBZ-UHFFFAOYSA-N
Data  1 IC50
  Tab Delimited (TSV)   2D SDfile   Computed 3D by Vconf -m prep SDfile
Find this compound or compounds like it in BindingDB:
Activity Spreadsheet -- Enzyme Inhibition Constant Data from BindingDB
Found 1 hit for monomerid = 366060
TargetP2X purinoceptor 4(Homo sapiens (Human))
Nippon Chemiphar
US Patent
LigandPNGBDBM366060(US9873683, Example 65)
Affinity DataIC50:  130nM. Assay description: The 1321N1 cells stably expressing human P2X4 receptor were seeded on a 96-well plate, cultured under the conditions of 37° C. and 5% CO2 for 24 hour...
Ligand InfoPC cidPC sid
In DepthDetails US Patent