BDBM36616 Rapamycin C-7, analog 8a
SMILES CO[C@@H]1C[C@H](C[C@@H](C)[C@@H]2CC(=O)[C@H](C)\C=C(C)\[C@@H](O)[C@@H](OC)C(=O)[C@H](C)C[C@H](C)\C=C\C=C\C=C(C)\[C@@H](C[C@@H]3CC[C@@H](C)[C@@](O)(O3)C(=O)C(=O)N3CCCC[C@H]3C(=O)O2)c2ccc(OC)cc2OC)CC[C@H]1O
InChI Key InChIKey=GSJHOKJUKNLENH-HSPDBSDPSA-N
Data  1 KI  1 EC50
  Tab Delimited (TSV)   2D SDfile   Computed 3D by Vconf -m prep SDfile
Find this compound or compounds like it in BindingDB:
Activity Spreadsheet -- Enzyme Inhibition Constant Data from BindingDB
Found 1 hit for monomerid = 36616
TargetPeptidyl-prolyl cis-trans isomerase FKBP1A(Homo sapiens (Human))
Smithkline Beecham Pharmaceuticals
LigandPNGBDBM36616(Rapamycin C-7, analog 8a)
Affinity DataKi:  9nM EC50:  1.00E+3nM. Assay description: FKBP12 assay using rapamycin analogs.
In DepthDetails ArticlePubMed