BDBM366438 N-methyl-N-(1- methyl-4-piperidyl)-4- [[8-(6-oxo- 3,4,7,8,9,9a- hexahydro-1H- pyrazino[1,2- c]pyrimidin-2-yl)- [1,2,4]triazolo[1,5- a]pyridin-2- yl]amino]benzamide::US9873709, Example 1-31
SMILES CN(C1CCN(C)CC1)C(=O)c1ccc(Nc2nc3c(cccn3n2)N2CCN3C(CCNC3=O)C2)cc1
InChI Key InChIKey=VHAGODWVGCOXPE-UHFFFAOYSA-N
Data  2 KI
  Tab Delimited (TSV)   2D SDfile   Computed 3D by Vconf -m prep SDfile
Find this compound or compounds like it in BindingDB:
Activity Spreadsheet -- Enzyme Inhibition Constant Data from BindingDB
Found 2 hits for monomerid = 366438
TargetTyrosine-protein kinase JAK2(Homo sapiens (Human))
Genentech
US Patent
LigandPNGBDBM366438(N-methyl-N-(1- methyl-4-piperidyl)-4- [[8-(6-oxo- ...)
Affinity DataKi:  52.4nM. Assay description: The activity of the isolated recombinant JAK1 and JAK2 kinase domain was measured by monitoring phosphorylation of a peptide derived from JAK3 (Val-A...
Ligand InfoPC cidPC sid
In DepthDetails US Patent
TargetTyrosine-protein kinase JAK1(Homo sapiens (Human))
Genentech
US Patent
LigandPNGBDBM366438(N-methyl-N-(1- methyl-4-piperidyl)-4- [[8-(6-oxo- ...)
Affinity DataKi:  453nM. Assay description: The activity of the isolated recombinant JAK1 and JAK2 kinase domain was measured by monitoring phosphorylation of a peptide derived from JAK3 (Val-A...
Ligand InfoPC cidPC sid
In DepthDetails US Patent