BDBM36678 Dansyl derivatives 16A, (S) isomer
SMILES CN(C)c1cccc2c(cccc12)S(=O)(=O)Oc1ccc(CC(N)C(=O)NCC(N)=O)cc1
InChI Key InChIKey=BRMHJVRZZQEFHO-UHFFFAOYSA-N
Data  1 IC50
  Tab Delimited (TSV)   2D SDfile   Computed 3D by Vconf -m prep SDfile
Find this compound or compounds like it in BindingDB:
Activity Spreadsheet -- Enzyme Inhibition Constant Data from BindingDB
Found 1 hit for monomerid = 36678
TargetThymidylate synthase(Lactobacillus casei)
Northwestern University
LigandPNGBDBM36678(Dansyl derivatives 16A, (S) isomer)
Affinity DataIC50:  1.96E+5nMpH: 7.4 T: 2°C. Assay description: The enzyme assay were performed spectrophotometrically by following the absorbance at 340nm using a hewlett Packard 8453 UV spectrophotometer equippe...
In DepthDetails ArticlePubMed