BDBM366960 1-[4-[2-[4-(3- aminoazetidine-1- carbonyl)anilino]- [1,2,4]triazolo[1,5- a]pyridin-8-yl]-3,6- dihydro-2H-pyridin-1- yl]-4,4,4-trifluoro- butan-1-one::US9873709, Example 2-256
SMILES NC1CN(C1)C(=O)c1ccc(Nc2nc3c(cccn3n2)C2=CCN(CC2)C(=O)CCC(F)(F)F)cc1
InChI Key InChIKey=MBHIHIBQGVZCKH-UHFFFAOYSA-N
Data  1 KI
  Tab Delimited (TSV)   2D SDfile   Computed 3D by Vconf -m prep SDfile
Find this compound or compounds like it in BindingDB:
Activity Spreadsheet -- Enzyme Inhibition Constant Data from BindingDB
Found 1 hit for monomerid = 366960
TargetTyrosine-protein kinase JAK1(Homo sapiens (Human))
Genentech
US Patent
LigandPNGBDBM366960(1-[4-[2-[4-(3- aminoazetidine-1- carbonyl)anilino]...)
Affinity DataKi:  0.670nM. Assay description: The activity of the isolated recombinant JAK1 and JAK2 kinase domain was measured by monitoring phosphorylation of a peptide derived from JAK3 (Val-A...
Ligand InfoPC cidPC sid
In DepthDetails US Patent