BDBM367670 (S)-2-amino-N-(methylsulfonyl)pent-4-ynamide hydrochloride ::US10227314, Example 9
SMILES CS(=O)(=O)NC(=O)[C@@H](N)CC#C
InChI Key InChIKey=PHFDNKAMFHABRE-YFKPBYRVSA-N
Data  1 IC50
  Tab Delimited (TSV)   2D SDfile   Computed 3D by Vconf -m prep SDfile
Find this compound or compounds like it in BindingDB:
Activity Spreadsheet -- Enzyme Inhibition Constant Data from BindingDB
Found 1 hit for monomerid = 367670
TargetCystathionine gamma-lyase(Homo sapiens (Human))
Sova Pharmaceuticals
US Patent
LigandPNGBDBM367670((S)-2-amino-N-(methylsulfonyl)pent-4-ynamide hydro...)
Affinity DataIC50:  1.25E+5nM. Assay description: Test compounds (from DMSO stock solutions) were added to (final concentrations) 20 ug/ml enzyme solution (human, mouse or rat recombinant CSE) plus 5...
In DepthDetails US Patent