BDBM36922 1,3-dimethyl-5-[1-(1-phenylethylamino)propylidene]-1,3-diazinane-2,4,6-trione::1,3-dimethyl-5-[1-(1-phenylethylamino)propylidene]barbituric acid::MLS000041300::SMR000043429::cid_5389588
SMILES [#6]-[#6]\[#6](-[#7]-[#6](-[#6])-c1ccccc1)=[#6]-1/[#6](=O)-[#7](-[#6])-[#6](=O)-[#7](-[#6])-[#6]-1=O
InChI Key InChIKey=VGVRPXDWSAJPOU-UHFFFAOYSA-N
Data  4 EC50
  Tab Delimited (TSV)   2D SDfile   Computed 3D by Vconf -m prep SDfile
Find this compound or compounds like it in BindingDB:
Activity Spreadsheet -- Enzyme Inhibition Constant Data from BindingDB
Found 4 hits for monomerid = 36922
TargetSphingosine 1-phosphate receptor 1(Homo sapiens (Human))
The Scripps Research Institute Molecular Screening Center
Curated by PubChem BioAssay
LigandPNGBDBM36922(1,3-dimethyl-5-[1-(1-phenylethylamino)propylidene]...)
Affinity DataEC50:  1.44E+4nM. Assay description: Source (MLSCN Center Name): The Scripps Research Institute Molecular Screening Center Center Affiliation: The Scripps Research Institute, TSRI Assay ...
In DepthDetails PCBioAssay
TargetHeat shock factor protein 1(Mus musculus)
Broad Institute
Curated by PubChem BioAssay
LigandPNGBDBM36922(1,3-dimethyl-5-[1-(1-phenylethylamino)propylidene]...)
Affinity DataEC50: >2.60E+5nM. Assay description: Keywords: Heat Shock Factor-1 (HSF-1), Stress Response, MG132, NIH3T3, Luminescence Assay Overview: Confirmation testing of small molecules identifie...
In DepthDetails PCBioAssay
TargetSphingosine 1-phosphate receptor 1(Homo sapiens (Human))
The Scripps Research Institute Molecular Screening Center
Curated by PubChem BioAssay
LigandPNGBDBM36922(1,3-dimethyl-5-[1-(1-phenylethylamino)propylidene]...)
Affinity DataEC50:  1.36E+4nM. Assay description: Source (MLSCN Center Name): The Scripps Research Institute Molecular Screening Center Center Affiliation: The Scripps Research Institute, TSRI Assay ...
In DepthDetails PCBioAssay
TargetSphingosine 1-phosphate receptor 1(Homo sapiens (Human))
The Scripps Research Institute Molecular Screening Center
Curated by PubChem BioAssay
LigandPNGBDBM36922(1,3-dimethyl-5-[1-(1-phenylethylamino)propylidene]...)
Affinity DataEC50: >3.00E+4nM. Assay description: Source (MLSCN Center Name): The Scripps Research Institute Molecular Screening Center Center Affiliation: The Scripps Research Institute, TSRI Assay ...
In DepthDetails PCBioAssay