BDBM369257 N-[4-[6-[1-(cyclopropanecarbonyl)-3,6- dihydro-2H-pyridin-4-yl]thieno[3,2- d]pyrimidin-4- yl]phenyl]cyclopropanesulfonamide::US10227357, Compound P-0571
SMILES O=C(C1CC1)N1CCC(=CC1)c1cc2ncnc(-c3ccc(NS(=O)(=O)C4CC4)cc3)c2s1
InChI Key InChIKey=KMUQDSCCWKNLFU-UHFFFAOYSA-N
Data  2 KI
  Tab Delimited (TSV)   2D SDfile   Computed 3D by Vconf -m prep SDfile
Find this compound or compounds like it in BindingDB:
Activity Spreadsheet -- Enzyme Inhibition Constant Data from BindingDB
Found 2 hits for monomerid = 369257
TargetMast/stem cell growth factor receptor Kit [D816V](Homo sapiens (Human))
Plexxikon
US Patent
LigandPNGBDBM369257(N-[4-[6-[1-(cyclopropanecarbonyl)-3,6- dihydro-2H-...)
Affinity DataKi:  500nM. Assay description: The c-Kit mutant D816V inhibitors were assessed using an engineered BaF3-FL KIT D816V or BaF3-FL KIT V560G/D816V cell line. The BaF3-FL KIT D816V cel...
Ligand InfoPC cidPC sid
In DepthDetails US Patent
TargetMast/stem cell growth factor receptor Kit(Homo sapiens (Human))
Plexxikon
US Patent
LigandPNGBDBM369257(N-[4-[6-[1-(cyclopropanecarbonyl)-3,6- dihydro-2H-...)
Affinity DataKi:  500nM. Assay description: The c-Kit mutant D816V inhibitors were assessed using an engineered BaF3-FL KIT D816V or BaF3-FL KIT V560G/D816V cell line. The BaF3-FL KIT D816V cel...
Ligand InfoPC cidPC sid
In DepthDetails US Patent