BDBM369359 4-ethyl-N-[1-[6-(1-methylpyrazol-4-yl)- 7H-pyrrolo[2,3-d]pyrimidin-4-yl]-4- piperidyl]benzenesulfonamide::US10227357, Compound P-0676
SMILES CCc1ccc(cc1)S(=O)(=O)NC1CCN(CC1)c1ncnc2[nH]c(cc12)-c1cnn(C)c1
InChI Key InChIKey=CTDNRRVSKCRXLI-UHFFFAOYSA-N
Data  2 KI
  Tab Delimited (TSV)   2D SDfile   Computed 3D by Vconf -m prep SDfile
Find this compound or compounds like it in BindingDB:
Activity Spreadsheet -- Enzyme Inhibition Constant Data from BindingDB
Found 2 hits for monomerid = 369359
TargetMast/stem cell growth factor receptor Kit [D816V](Homo sapiens (Human))
Plexxikon
US Patent
LigandPNGBDBM369359(4-ethyl-N-[1-[6-(1-methylpyrazol-4-yl)- 7H-pyrrolo...)
Affinity DataKi:  500nM. Assay description: The c-Kit mutant D816V inhibitors were assessed using an engineered BaF3-FL KIT D816V or BaF3-FL KIT V560G/D816V cell line. The BaF3-FL KIT D816V cel...
Ligand InfoPC cidPC sid
In DepthDetails US Patent
TargetMast/stem cell growth factor receptor Kit(Homo sapiens (Human))
Plexxikon
US Patent
LigandPNGBDBM369359(4-ethyl-N-[1-[6-(1-methylpyrazol-4-yl)- 7H-pyrrolo...)
Affinity DataKi:  500nM. Assay description: The c-Kit mutant D816V inhibitors were assessed using an engineered BaF3-FL KIT D816V or BaF3-FL KIT V560G/D816V cell line. The BaF3-FL KIT D816V cel...
Ligand InfoPC cidPC sid
In DepthDetails US Patent