BDBM369398 4-[6-(4-fluorophenyl)-7H-pyrrolo[2,3- d]pyrimidin-4-yl]-2,2-dimethyl-N-[(1S)-1- (p-tolyl)ethyl]piperazine-1-carboxamide::US10227357, Compound P-0719
SMILES C[C@H](NC(=O)N1CCN(CC1(C)C)c1ncnc2[nH]c(cc12)-c1ccc(F)cc1)c1ccc(C)cc1
InChI Key
Data  2 KI
  Tab Delimited (TSV)   2D SDfile   Computed 3D by Vconf -m prep SDfile
Find this compound or compounds like it in BindingDB:
Activity Spreadsheet -- Enzyme Inhibition Constant Data from BindingDB
Found 2 hits for monomerid = 369398
TargetMast/stem cell growth factor receptor Kit [D816V](Homo sapiens (Human))
Plexxikon
US Patent
LigandPNGBDBM369398(4-[6-(4-fluorophenyl)-7H-pyrrolo[2,3- d]pyrimidin-...)
Affinity DataKi:  500nM. Assay description: The c-Kit mutant D816V inhibitors were assessed using an engineered BaF3-FL KIT D816V or BaF3-FL KIT V560G/D816V cell line. The BaF3-FL KIT D816V cel...
Ligand InfoPC cidPC sid
In DepthDetails US Patent
TargetMast/stem cell growth factor receptor Kit(Homo sapiens (Human))
Plexxikon
US Patent
LigandPNGBDBM369398(4-[6-(4-fluorophenyl)-7H-pyrrolo[2,3- d]pyrimidin-...)
Affinity DataKi:  500nM. Assay description: The c-Kit mutant D816V inhibitors were assessed using an engineered BaF3-FL KIT D816V or BaF3-FL KIT V560G/D816V cell line. The BaF3-FL KIT D816V cel...
Ligand InfoPC cidPC sid
In DepthDetails US Patent