BDBM369407 4-chloro-N-[1-(6-methyl-7H- pyrrolo[2,3-d]pyrimidin-4-yl)-4- piperidyl]benzenesulfonamide::US10227357, Compound P-0728
SMILES Cc1cc2c(ncnc2[nH]1)N1CCC(CC1)NS(=O)(=O)c1ccc(Cl)cc1
InChI Key InChIKey=BVAXSRCAJDSGBW-UHFFFAOYSA-N
Data  2 KI
  Tab Delimited (TSV)   2D SDfile   Computed 3D by Vconf -m prep SDfile
Find this compound or compounds like it in BindingDB:
Activity Spreadsheet -- Enzyme Inhibition Constant Data from BindingDB
Found 2 hits for monomerid = 369407
TargetMast/stem cell growth factor receptor Kit [D816V](Homo sapiens (Human))
Plexxikon
US Patent
LigandPNGBDBM369407(4-chloro-N-[1-(6-methyl-7H- pyrrolo[2,3-d]pyrimidi...)
Affinity DataKi:  500nM. Assay description: The c-Kit mutant D816V inhibitors were assessed using an engineered BaF3-FL KIT D816V or BaF3-FL KIT V560G/D816V cell line. The BaF3-FL KIT D816V cel...
Ligand InfoPC cidPC sid
In DepthDetails US Patent
TargetMast/stem cell growth factor receptor Kit(Homo sapiens (Human))
Plexxikon
US Patent
LigandPNGBDBM369407(4-chloro-N-[1-(6-methyl-7H- pyrrolo[2,3-d]pyrimidi...)
Affinity DataKi:  500nM. Assay description: The c-Kit mutant D816V inhibitors were assessed using an engineered BaF3-FL KIT D816V or BaF3-FL KIT V560G/D816V cell line. The BaF3-FL KIT D816V cel...
Ligand InfoPC cidPC sid
In DepthDetails US Patent