BDBM36962 4-amino-N-[2-[[5-bromo-2-(2-fluorobenzyl)oxy-benzyl]amino]ethyl]furazan-3-carboxamide;hydrochloride::4-amino-N-[2-[[5-bromo-2-[(2-fluorophenyl)methoxy]phenyl]methylamino]ethyl]-1,2,5-oxadiazole-3-carboxamide;hydrochloride::4-azanyl-N-[2-[[5-bromanyl-2-[(2-fluorophenyl)methoxy]phenyl]methylamino]ethyl]-1,2,5-oxadiazole-3-carboxamide;hydrochloride::MLS000083800::SMR000048667::cid_6603347
SMILES Nc1nonc1C(=O)NCCNCc1cc(Br)ccc1OCc1ccccc1F
InChI Key InChIKey=VJTIFSGFGLTUDR-UHFFFAOYSA-N
Data  3 EC50
  Tab Delimited (TSV)   2D SDfile   Computed 3D by Vconf -m prep SDfile
Find this compound or compounds like it in BindingDB:
Activity Spreadsheet -- Enzyme Inhibition Constant Data from BindingDB
Found 3 hits for monomerid = 36962
TargetSphingosine 1-phosphate receptor 1(Homo sapiens (Human))
The Scripps Research Institute Molecular Screening Center
Curated by PubChem BioAssay
LigandPNGBDBM36962(4-amino-N-[2-[[5-bromo-2-(2-fluorobenzyl)oxy-benzy...)
Affinity DataEC50:  8.91E+3nM. Assay description: Source (MLSCN Center Name): The Scripps Research Institute Molecular Screening Center Center Affiliation: The Scripps Research Institute, TSRI Assay ...
In DepthDetails PCBioAssay
TargetSphingosine 1-phosphate receptor 1(Homo sapiens (Human))
The Scripps Research Institute Molecular Screening Center
Curated by PubChem BioAssay
LigandPNGBDBM36962(4-amino-N-[2-[[5-bromo-2-(2-fluorobenzyl)oxy-benzy...)
Affinity DataEC50:  8.07E+3nM. Assay description: Source (MLSCN Center Name): The Scripps Research Institute Molecular Screening Center Center Affiliation: The Scripps Research Institute, TSRI Assay ...
In DepthDetails PCBioAssay
TargetSphingosine 1-phosphate receptor 1(Homo sapiens (Human))
The Scripps Research Institute Molecular Screening Center
Curated by PubChem BioAssay
LigandPNGBDBM36962(4-amino-N-[2-[[5-bromo-2-(2-fluorobenzyl)oxy-benzy...)
Affinity DataEC50:  2.89E+4nM. Assay description: Source (MLSCN Center Name): The Scripps Research Institute Molecular Screening Center Center Affiliation: The Scripps Research Institute, TSRI Assay ...
In DepthDetails PCBioAssay