BDBM370431 1-(4-aminophenyl)-2-(5H-imidazo[5,1- a]isoindol-5-yl)ethanol::US10233190, Example 1303
SMILES Nc1ccc(cc1)C(O)CC1c2ccccc2-c2cncn12
InChI Key InChIKey=CCWQDYPXEQFDAH-UHFFFAOYSA-N
Data  1 IC50
  Tab Delimited (TSV)   2D SDfile   Computed 3D by Vconf -m prep SDfile
Find this compound or compounds like it in BindingDB:
Activity Spreadsheet -- Enzyme Inhibition Constant Data from BindingDB
Found 1 hit for monomerid = 370431
TargetIndoleamine 2,3-dioxygenase 1(Homo sapiens (Human))
Newlink Genetics
US Patent
LigandPNGBDBM370431(1-(4-aminophenyl)-2-(5H-imidazo[5,1- a]isoindol-5-...)
Affinity DataIC50:  5.50E+3nM. Assay description: The IC50 values for each compound were determined by testing the activity of IDO in a mixture containing 50 mM potassium phosphate buffer at pH 6.5; ...
Ligand InfoPC cidPC sid
In DepthDetails US Patent