BDBM370444 1-(3-chlorophenyl)-2-(5H-imidazo[5,1- a]isoindol-5-yl)ethanol::US10233190, Example 1343
SMILES OC(CC1c2ccccc2-c2cncn12)c1cccc(Cl)c1
InChI Key InChIKey=KYSMLSSHZDKYMC-UHFFFAOYSA-N
Data  1 IC50
  Tab Delimited (TSV)   2D SDfile   Computed 3D by Vconf -m prep SDfile
Find this compound or compounds like it in BindingDB:
Activity Spreadsheet -- Enzyme Inhibition Constant Data from BindingDB
Found 1 hit for monomerid = 370444
TargetIndoleamine 2,3-dioxygenase 1(Homo sapiens (Human))
Newlink Genetics
US Patent
LigandPNGBDBM370444(1-(3-chlorophenyl)-2-(5H-imidazo[5,1- a]isoindol-5...)
Affinity DataIC50: <1.00E+3nM. Assay description: The IC50 values for each compound were determined by testing the activity of IDO in a mixture containing 50 mM potassium phosphate buffer at pH 6.5; ...
Ligand InfoPC cidPC sid
In DepthDetails US Patent