BDBM37077 4-[[7-(diethylamino)-2-keto-chromen-3-yl]amino]-4-keto-butyric acid::4-[[7-(diethylamino)-2-oxidanylidene-chromen-3-yl]amino]-4-oxidanylidene-butanoic acid::4-[[7-(diethylamino)-2-oxo-1-benzopyran-3-yl]amino]-4-oxobutanoic acid::4-[[7-(diethylamino)-2-oxochromen-3-yl]amino]-4-oxobutanoic acid::4-{[7-(diethylamino)-2-oxo-2H-chromen-3-yl]amino}-4-oxobutanoic acid::MLS000089659::SMR000024277::cid_3243384
SMILES CCN(CC)c1ccc2cc(NC(=O)CCC(O)=O)c(=O)oc2c1
InChI Key InChIKey=SMSLFSMAYOUFSR-UHFFFAOYSA-N
Data  6 IC50  6 EC50
  Tab Delimited (TSV)   2D SDfile   Computed 3D by Vconf -m prep SDfile
Find this compound or compounds like it in BindingDB:
Activity Spreadsheet -- Enzyme Inhibition Constant Data from BindingDB
Found 12 hits for monomerid = 37077
TargetSphingosine 1-phosphate receptor 1(Homo sapiens (Human))
The Scripps Research Institute Molecular Screening Center
Curated by PubChem BioAssay
LigandPNGBDBM37077(4-[[7-(diethylamino)-2-keto-chromen-3-yl]amino]-4-...)
Affinity DataEC50:  8.31E+3nM. Assay description: Source (MLSCN Center Name): The Scripps Research Institute Molecular Screening Center Center Affiliation: The Scripps Research Institute, TSRI Assay ...
In DepthDetails PCBioAssay
TargetSphingosine 1-phosphate receptor 1(Homo sapiens (Human))
The Scripps Research Institute Molecular Screening Center
Curated by PubChem BioAssay
LigandPNGBDBM37077(4-[[7-(diethylamino)-2-keto-chromen-3-yl]amino]-4-...)
Affinity DataEC50:  6.10E+3nM. Assay description: Source (MLSCN Center Name): The Scripps Research Institute Molecular Screening Center Center Affiliation: The Scripps Research Institute, TSRI Assay ...
In DepthDetails PCBioAssay
TargetSphingosine 1-phosphate receptor 1(Homo sapiens (Human))
The Scripps Research Institute Molecular Screening Center
Curated by PubChem BioAssay
LigandPNGBDBM37077(4-[[7-(diethylamino)-2-keto-chromen-3-yl]amino]-4-...)
Affinity DataEC50:  9.78E+3nM. Assay description: Source (MLSCN Center Name): The Scripps Research Institute Molecular Screening Center Center Affiliation: The Scripps Research Institute, TSRI Assay ...
In DepthDetails PCBioAssay
TargetIsoform 2 of Nuclear receptor ROR-alpha (Alpha-2)(Homo sapiens (Human))
The Scripps Research Institute Molecular Screening Center
Curated by PubChem BioAssay
LigandPNGBDBM37077(4-[[7-(diethylamino)-2-keto-chromen-3-yl]amino]-4-...)
Affinity DataIC50:  4.39E+3nM. Assay description: Source (MLSCN Center Name): The Scripps Research Institute Molecular Screening Center Center Affiliation: The Scripps Research Institute, TSRI Assay ...
In DepthDetails PCBioAssay
TargetSteroidogenic factor 1(Homo sapiens (Human))
The Scripps Research Institute Molecular Screening Center
Curated by PubChem BioAssay
LigandPNGBDBM37077(4-[[7-(diethylamino)-2-keto-chromen-3-yl]amino]-4-...)
Affinity DataIC50:  6.08E+3nM. Assay description: Source (MLSCN Center Name): The Scripps Research Institute Molecular Screening Center Center Affiliation: The Scripps Research Institute, TSRI Assay ...
In DepthDetails PCBioAssay
TargetGlycoprotein 42(Human herpesvirus 4 type 2)
Emory University
Curated by PubChem BioAssay
LigandPNGBDBM37077(4-[[7-(diethylamino)-2-keto-chromen-3-yl]amino]-4-...)
Affinity DataIC50:  1.84E+3nM. Assay description: NIH Molecular Libraries Screening Centers Network [MLSCN] Emory Chemical Biology Discovery Center in MLSCN Assay provider: Theodore Jardetzky; Northw...
In DepthDetails PCBioAssay
TargetSteroidogenic factor 1(Homo sapiens (Human))
The Scripps Research Institute Molecular Screening Center
Curated by PubChem BioAssay
LigandPNGBDBM37077(4-[[7-(diethylamino)-2-keto-chromen-3-yl]amino]-4-...)
Affinity DataIC50:  5.11E+3nM. Assay description: Source (MLSCN Center Name): The Scripps Research Institute Molecular Screening Center Center Affiliation: The Scripps Research Institute, TSRI Assay ...
In DepthDetails PCBioAssay
TargetHeat shock protein HSP 90-alpha(Homo sapiens (Human))
The Scripps Research Institute Molecular Screening Center
Curated by PubChem BioAssay
LigandPNGBDBM37077(4-[[7-(diethylamino)-2-keto-chromen-3-yl]amino]-4-...)
Affinity DataIC50: >6.00E+4nM. Assay description: Source (MLPCN Center Name): The Scripps Research Institute Molecular Screening Center (SRIMSC) Center Affiliation: The Scripps Research Institute (TS...
In DepthDetails PCBioAssay
TargetMatrix metalloproteinase-14 [1-36](Homo sapiens (Human))
Sanford-Burnham Center For Chemical Genomics
Curated by PubChem BioAssay
LigandPNGBDBM37077(4-[[7-(diethylamino)-2-keto-chromen-3-yl]amino]-4-...)
Affinity DataEC50:  670nM. Assay description: Data Source: Sanford-Burnham Center for Chemical Genomics (SBCCG) Source Affiliation: Sanford-Burnham Medical Research Institute (SBMRI, San Diego, C...
In DepthDetails PCBioAssay
TargetPOsterior Segregation(Caenorhabditis elegans)
Broad Institute
Curated by PubChem BioAssay
LigandPNGBDBM37077(4-[[7-(diethylamino)-2-keto-chromen-3-yl]amino]-4-...)
Affinity DataEC50:  1.20E+5nM. Assay description: Broad Institute: MLPCN maternal gene expression Project ID: 2024 Keywords: Zinc finger, C. elegans, maternal gene expression, RNA-protein interac...
In DepthDetails PCBioAssay
TargetZinc finger protein mex-5(Caenorhabditis elegans)
Broad Institute
Curated by PubChem BioAssay
LigandPNGBDBM37077(4-[[7-(diethylamino)-2-keto-chromen-3-yl]amino]-4-...)
Affinity DataEC50:  7.36E+3nM. Assay description: Broad Institute: MLPCN maternal gene expression Project ID: 2024 Keywords: Zinc finger, C. elegans, maternal gene expression, RNA-protein interac...
In DepthDetails PCBioAssay
TargetIsoform 2 of Nuclear receptor ROR-alpha (Alpha-2)(Homo sapiens (Human))
The Scripps Research Institute Molecular Screening Center
Curated by PubChem BioAssay
LigandPNGBDBM37077(4-[[7-(diethylamino)-2-keto-chromen-3-yl]amino]-4-...)
Affinity DataIC50:  5.29E+3nM. Assay description: Source (MLSCN Center Name): The Scripps Research Institute Molecular Screening Center Center Affiliation: The Scripps Research Institute, TSRI Assay ...
In DepthDetails PCBioAssay